{"text_format":"1","workbook":"xlsx","n_sheets":3,"sheets":["Collateral Tables","Note Balance","Cumulative Defaults"],"not_rendered":{"charts":1,"images":0,"macros":1,"external_links":8,"defined_names":24,"comments":1,"pivot_tables":0},"unopened":[],"bounds":{"document_bytes":16777216,"sheet_cells":100000,"rows_first":2000,"rows_last":500,"rows_between":2000,"halvings":0,"cell_chars":16384,"cell_head_chars":4096},"cells_cut":0,"cells_raw":0,"read":"whole","date_system":"1900"}

{"sheet":"Collateral Tables","index":0,"n_rows":241,"n_cols":31,"rows_kept":241,"cut":false,"hidden":false,"merged":[]}
[null,"CNHI CAPITAL AUSTRALIA RECEIVABLES TRUST SERIES 2017-1 (TERM DEAL)"]
[null,"COLLATERAL DATA TABLES"]
[]
[null,"OUTSTANDING RECEIVABLES",null,null,"2019-04-30",null,null,null,"2019-01-31",null,null,null,"2018-10-31",null,null,null,"2018-07-31",null,null,null,"2018-04-30",null,null,null,"2018-01-31",null,null,null,"2017-10-31"]
[]
[null,"Opening Balance",null,null,{"$f":"I13","v":230544996.13000011},null,null,null,259202455.34000018,null,null,null,283467876.49000013,null,null,null,308006527.8300001,null,null,null,379616885.59000003,null,null,null,413211906.91000003,null,null,null,449999902.83999997]
[null,"Principal Repayments - Scheduled",null,null,{"$f":"MIN(([3]Sheet1!$B$3+[4]Sheet1!$B$3+[5]Sheet1!$B$3),'[2]16 May 19'!D23)","v":55053713.039999992},null,null,null,24431755.949999996,null,null,null,17041956.469999991,null,null,null,21065667.00999999,null,null,null,69066943.859999925,null,null,null,28752953.190000005,null,null,null,29068085.999999996]
[null,"Principal Repayments - Unscheduled",null,null,{"$f":"'[2]16 May 19'!$H$23-'Collateral Tables'!E7","v":6413098.7499999627},null,null,null,4225703.2600000873,null,null,null,7032919.4199999645,null,null,null,3460781.3899999671,null,null,null,2543413.9000000507,null,null,null,4655843.9099999405,null,null,null,7719909.9299999438]
[{"$f":"SUM(AC9)","v":0},"Charge-Offs",null,null,{"$f":"'[2]16 May 19'!$H37","v":0},null,null,null,0,null,null,null,190545.26,null,null,null,12202.94,null,null,null,0,null,null,null,186224.22,null,null,null,0]
[null,"Reinstatements"]
[null,"New Receivables Purchased"]
[null,"Non Cash Change in Receivables"]
[null,"Closing Balance",null,null,{"$f":"E6-E7-E8-E9+E10+E11-E12","v":169078184.34000015},null,null,null,230544996.13000011,null,null,null,259202455.34000018,null,null,null,283467876.49000013,null,null,null,308006527.8300001,null,null,null,379616885.59000003,null,null,null,413211906.91000003]
[]
[null,"PORTFOLIO STATISTICS"]
[]
[null,"Summary"]
[null,"Number of contracts",null,null,{"$f":"[6]Summary!$B$4","v":2757},null,null,null,3136,null,null,null,3411,null,null,null,3664,null,null,null,3817,null,null,null,4136,null,null,null,4356]
[null,"Dollar value of contracts",null,null,{"$f":"[6]Summary!$B$6","v":61326.871360174053},null,null,null,73515.623765943761,null,null,null,75990.16574025208,null,null,null,77365.686814956192,null,null,null,80693.352850405878,null,null,null,91783.579688104655,null,null,null,94860.401035353672]
[null,"Number of contracts closed during the Quarter",null,null,{"$f":"[6]Summary!$B$19","v":379},null,null,null,275,null,null,null,251,null,null,null,152,null,null,null,319,null,null,null,219,null,null,null,259]
[null,"Dollar value of contracts closed during the Quarter",null,null,{"$f":"[6]Summary!$B$20","v":20529534.610000007},null,null,null,9816130.639999995,null,null,null,9299561.7100000028,null,null,null,6037872.459999999,null,null,null,13675265.359999986,null,null,null,7726571.4600000046,null,null,null,11324349.980000002]
[]
[{"$f":"SUM(AC23)","v":0},"Dollar Value of Recoveries from Collateral",null,null,{"$f":"[6]Summary!$C$16","v":2340},null,null,null,1800,null,null,null,1440,null,null,null,0,null,null,null,218294.43636363634,null,null,null,0,null,null,null,0]
[null,"Dollar Value of Recoveries from Other Sources",null,null,{"$f":"[1]Summary!$C$14","v":0},null,null,null,0,null,null,null,0,null,null,null,0,null,null,null,0,null,null,null,0,null,null,null,0]
[]
[null,"Average Term of Contracts (Months)",null,null,{"$f":"[7]Sheet1!$W$2759","v":55.57535003040001},null,null,null,54.529554227631905,null,null,null,54.119601323102223,null,null,null,53.909627887868069,null,null,null,53.612656471534798,null,null,null,53.056586732928359,null,null,null,52.791142825226352]
[null,"Average Term to Maturity (Months)",null,null,{"$f":"[7]Sheet1!$X$2759","v":22.324245108048785},null,null,null,23.733607956577114,null,null,null,26.144061733099758,null,null,null,28.742783944400294,null,null,null,31.280104809978692,null,null,null,32.807837730830528,null,null,null,35.248005455642144]
[null,"Average Residual / Balloon Payment *",null,null,{"$f":"[7]Sheet1!$AI$2759","v":3.922434770280607E-2},null,null,null,3.5186054167085742E-2,null,null,null,3.4984231038761755E-2,null,null,null,3.4894766372251113E-2,null,null,null,3.415862294888309E-2,null,null,null,3.2130613200688406E-2,null,null,null,3.1883835949619785E-2]
[null,"Average Seasoning (Months)",null,null,{"$f":"E26-E27","v":33.251104922351225},null,null,null,30.795946271054792,null,null,null,27.975539590002466,null,null,null,25.166843943467775,null,null,null,22.332551661556106,null,null,null,20.248749002097831,null,null,null,17.543137369584208]
[null,"Average Dollar Value of Individual Assets",null,null,{"$f":"E19/E18","v":22.244059252874159},null,null,null,23.442482068221864,null,null,null,22.277972952287328,null,null,null,21.115089196221668,null,null,null,21.14051685889596,null,null,null,22.191387738903448,null,null,null,21.776951569181282]
[null,"Weighted Average Interest Rate",null,null,{"$f":"[7]Sheet1!$AA$2759/100","v":2.6788837127800211E-2},null,null,null,2.6707041938835663E-2,null,null,null,2.6574534983816993E-2,null,null,null,2.6681749553637942E-2,null,null,null,2.6740005423353815E-2,null,null,null,2.7037203243209434E-2,null,null,null,2.7224187345666846E-2]
[]
[null,"Payment in Arrears"]
["1. 0 - 30 Days","0 - 30 Days",null,null,{"$f":"IFERROR(VLOOKUP($A$34,'[8]Arrears Reporting'!$A$1:$D$7,3,FALSE),0)","v":2744},{"$f":"IFERROR(VLOOKUP($A$34,'[8]Arrears Reporting'!$A$1:$D$7,2,FALSE),0)","v":195519.78},{"$f":"F34/F$50","v":1.1563867968136486E-3},null,3128,148936.91999999998,6.4602104795203393E-4,null,3405,244573.95,9.4356339981111923E-4,null,3656,2564.3500000000099,9.0463513247169578E-6,null,3804,490793.4200000001,1.59345135785852E-3,null,4131,190928.48999999996,5.0295046729351557E-4,null,4347,271017.78999999992,6.5588088210398259E-4]
["2. 31 - 60 Days","31 - 60 Days",null,null,{"$f":"IFERROR(VLOOKUP($A$35,'[8]Arrears Reporting'!$A$1:$D$7,3,FALSE),0)","v":8},{"$f":"IFERROR(VLOOKUP($A$35,'[8]Arrears Reporting'!$A$1:$D$7,2,FALSE),0)","v":97001.859999999986},{"$f":"F35/F$50","v":5.7371008790192983E-4},null,4,11616.369999999981,5.0386563122149681E-5,null,3,28877.220000000005,1.1140797243653158E-4,null,2,19298.430000000004,6.8079777641685756E-5,null,6,77740.689999999988,2.5239948824366516E-4,null,1,13341.020000000008,3.5143378775855515E-5,null,5,35820.54,8.6688063439086416E-5]
["3. 61 - 90 Days","61 - 90 Days",null,null,{"$f":"IFERROR(VLOOKUP($A$36,'[8]Arrears Reporting'!$A$1:$D$7,3,FALSE),0)","v":4},{"$f":"IFERROR(VLOOKUP($A$36,'[8]Arrears Reporting'!$A$1:$D$7,2,FALSE),0)","v":148051.94},8.7564188471696573E-4,null,0,0,0,null,3,10324.189999999991,3.983060263243878E-5,null,0,0,0,null,5,98534.729999999981,3.1991117426701155E-4,null,3,20131.840000000007,5.3031992949183719E-5,null,2,107243.40000000002,2.5953608356053045E-4]
["4. 91 - 120 Days","91 - 120 Days",null,null,{"$f":"IFERROR(VLOOKUP($A$37,'[8]Arrears Reporting'!$A$1:$D$7,3,FALSE),0)","v":1},{"$f":"IFERROR(VLOOKUP($A$37,'[8]Arrears Reporting'!$A$1:$D$7,2,FALSE),0)","v":9447.4200000000055},5.5876043600055232E-5,null,2,15837.970000000005,6.8697955999310852E-5,null,0,0,0,null,3,36625.689999999995,1.2920578674914553E-4,null,1,3775.0599999999981,1.225642854583784E-5,null,1,3861.3100000000036,1.0171597066865854E-5,null,1,25089.710000000014,6.0718748856055268E-5]
["5. 121 - 150 Days","121 - 150 Days",null,null,{"$f":"IFERROR(VLOOKUP($A$38,'[8]Arrears Reporting'!$A$1:$D$7,3,FALSE),0)","v":0},{"$f":"IFERROR(VLOOKUP($A$38,'[8]Arrears Reporting'!$A$1:$D$7,2,FALSE),0)","v":0},0,null,1,5325.0599999999977,2.3097703656067661E-5,null,0,0,0,null,2,11452.769999999979,4.0402355786526038E-5,null,1,0,0,null,0,0,0,null,1,0,0]
["6. 151 - 180 Days","151 - 180 Days",null,null,{"$f":"IFERROR(VLOOKUP($A$39,'[8]Arrears Reporting'!$A$1:$D$7,3,FALSE),0)","v":0},{"$f":"IFERROR(VLOOKUP($A$39,'[8]Arrears Reporting'!$A$1:$D$7,2,FALSE),0)","v":0},0,null,1,3951.9700000000057,1.7141859794569431E-5,null,0,0,0,null,1,10444.409999999982,3.6845127318574497E-5,null,0,0,0,null,0,0,0,null,0,0,0]
[null,"Total",null,null,{"$f":"SUM(E34:E39)","v":2757},{"$f":"SUM(F34:F39)","v":450021},{"$f":"SUM(G34:G39)","v":2.6616148130325997E-3},null,3136,185668.28999999998,8.053451305241315E-4,null,3411,283775.36000000004,1.0948019748800895E-3,null,3664,80385.649999999965,2.8357939882064876E-4,null,3817,670843.90000000014,2.1780184489150344E-3,null,4136,228262.65999999997,6.0129743608542069E-4,null,4356,439171.43999999994,1.0628237779596547E-3]
[null,"* Expressed as a % of Aggreg. Rec. closing bal.",null,null,null,"> 30 days",{"$f":"SUM(G35:G39)","v":1.5052280162189508E-3},null,null,"> 30 days",1.5932408257209762E-4,null,null,"> 30 days",1.5123857506897035E-4,null,null,"> 30 days",2.7453304749593181E-4,null,null,"> 30 days",5.8456709105651446E-4,null,null,"> 30 days",9.8346968791905093E-5,null,null,"> 30 days",4.0694289585567212E-4]
[]
[" 0 - 30 Days","Account Balances in Arrears"]
["1. 0 - 30 Days","0 - 30 Days",null,null,{"$f":"IFERROR(VLOOKUP($A$44,'[8]Arrears Reporting'!$A$1:$D$7,3,FALSE),0)","v":2744},{"$f":"IFERROR(VLOOKUP($A$44,'[8]Arrears Reporting'!$A$1:$D$7,4,FALSE),0)","v":168108309.51999983},{"$f":"F44/F$50","v":0.99426374949680285},null,3128,230291452.75999966,0.99890024344810757,null,3405,259010982.71999982,0.99926130090184206,null,3656,282794384.02999949,0.99762409600572943,null,3804,307220774.93999904,0.99744890832172972,null,4131,379431680.77000087,0.9995121270232431,null,4347,412348242.53000063,0.99790987537978171]
["2. 31 - 60 Days","31 - 60 Days",null,null,{"$f":"IFERROR(VLOOKUP($A$45,'[8]Arrears Reporting'!$A$1:$D$7,3,FALSE),0)","v":8},{"$f":"IFERROR(VLOOKUP($A$45,'[8]Arrears Reporting'!$A$1:$D$7,4,FALSE),0)","v":322182.38},{"$f":"F45/F$50","v":1.9055230647149752E-3},null,4,164754.28,7.1462960708589137E-4,null,3,126660.98000000001,4.8865655934415006E-4,null,2,386487.83999999985,1.3634272947807362E-3,null,6,379940.5,1.233546907842499E-3,null,1,12202.940000000002,3.2145408866716198E-5,null,5,283384.2,6.8580840789208522E-4]
["3. 61 - 90 Days","61 - 90 Days",null,null,{"$f":"IFERROR(VLOOKUP($A$46,'[8]Arrears Reporting'!$A$1:$D$7,3,FALSE),0)","v":4},{"$f":"IFERROR(VLOOKUP($A$46,'[8]Arrears Reporting'!$A$1:$D$7,4,FALSE),0)","v":499372.13},2.9534982999096506E-3,null,0,0,0,null,3,64811.640000000007,2.5004253881386111E-4,null,0,0,0,null,5,358218.15999999992,1.163021324657491E-3,null,3,134159.14000000001,3.5340667154857923E-4,null,2,207466.89000000004,5.0208352308005319E-4]
["4. 91 - 120 Days","91 - 120 Days",null,null,{"$f":"IFERROR(VLOOKUP($A$47,'[8]Arrears Reporting'!$A$1:$D$7,3,FALSE),0)","v":1},{"$f":"IFERROR(VLOOKUP($A$47,'[8]Arrears Reporting'!$A$1:$D$7,4,FALSE),0)","v":148320.30999999997},{"$f":"F47/F$50","v":8.7722913857261572E-4},null,2,38009.410000000003,1.6486764249078417E-4,null,0,0,0,null,3,128825.05999999998,4.5446087787850216E-4,null,1,35391.29,1.1490435040238447E-4,null,1,38842.74,1.0232089634166452E-4,null,1,356437.59,8.6260241788636003E-4]
["5. 121 - 150 Days","121 - 150 Days",null,null,{"$f":"IFERROR(VLOOKUP($A$48,'[8]Arrears Reporting'!$A$1:$D$7,3,FALSE),0)","v":0},{"$f":"IFERROR(VLOOKUP($A$48,'[8]Arrears Reporting'!$A$1:$D$7,4,FALSE),0)","v":0},{"$f":"F48/F$50","v":0},null,1,26802.450000000004,1.1625691491862459E-4,null,0,0,0,null,2,148341.91,5.2331118374618856E-4,null,1,12202.940000000002,3.9619095367794555E-5,null,0,0,0,null,1,16375.699999999995,3.9630271359936141E-5]
["6. 151 - 180 Days","151 - 180 Days",null,null,{"$f":"IFERROR(VLOOKUP($A$49,'[8]Arrears Reporting'!$A$1:$D$7,3,FALSE),0)","v":0},{"$f":"IFERROR(VLOOKUP($A$49,'[8]Arrears Reporting'!$A$1:$D$7,4,FALSE),0)","v":0},{"$f":"F49/F$50","v":0},null,1,23977.23000000001,1.0400238739720787E-4,null,0,0,0,null,1,9837.6499999999942,3.470463786519055E-5,null,0,0,0,null,0,0,0,null,0,0,0]
[null,"Total",null,null,{"$f":"SUM(E44:E49)","v":2757},{"$f":"SUM(F44:F49)","v":169078184.33999982},{"$f":"SUM(G44:G49)","v":1},null,3136,230544996.12999964,1.0000000000000002,null,3411,259202455.33999979,1,null,3664,283467876.48999947,1,null,3817,308006527.82999909,0.99999999999999989,null,4136,379616885.59000087,1.0000000000000002,null,4356,413211906.91000056,1.0000000000000002]
["NSW",null,null,null,null,"> 30 days",{"$f":"SUM(G45:G49)","v":5.7362505031972408E-3},null,null,"> 30 days",1.099756551892508E-3,null,null,"> 30 days",7.3869909815801123E-4,null,null,"> 30 days",2.3759039942706172E-3,null,null,"> 30 days",2.5510916782701689E-3,null,null,"> 30 days",4.8787297675695996E-4,null,null,"> 30 days",2.0901246202184344E-3]
[null,null,null,null,null,">90 days",{"$f":"SUM(G47:G49)","v":8.7722913857261572E-4},null,null,">90 days",3.8512694480661664E-4,null,null,">90 days",0,null,null,">90 days",1.0124766994898812E-3,null,null,">90 days",1.5452344577017901E-4,null,null,">90 days",1.0232089634166452E-4,null,null,">90 days",9.022326892462962E-4]
[]
["VIC","Geographic Distribution"]
["NSW","New South Wales",null,null,{"$f":"F55/F$63","v":0.32159306661738435},{"$f":"IFERROR(VLOOKUP($A$55,'[8]Geographic '!$A$1:$C$10,3,FALSE),0)","v":54374371.800000019},null,null,0.32861234306417303,75759931.359999999,null,null,0.32940997197731231,85383873.549999908,null,null,0.33642464243515169,95365578.98999998,null,null,0.34323414336318814,105718356.73000002,null,null,0.33285587732383132,126357711.49999988,null,null,0.33195637419004981,137168326.38999993]
["VIC","Victoria",null,null,{"$f":"F56/F$63","v":0.16952528205744988},{"$f":"IFERROR(VLOOKUP($A$56,'[8]Geographic '!$A$1:$C$10,3,FALSE),0)","v":28663026.890000012},null,null,0.15949989480259649,36771902.630000018,null,null,0.15682064128860596,40648295.270000026,null,null,0.16003502958332694,45364790.000000007,null,null,0.16474594459896272,50742826.370000042,null,null,0.15885043223585349,60302306.360000007,null,null,0.15904321078606742,65718548.409999982]
["QLD","Queensland",null,null,0.11314781977744533,{"$f":"IFERROR(VLOOKUP($A$57,'[8]Geographic '!$A$1:$C$10,3,FALSE),0)","v":19130827.930000003},null,null,0.10137109350584979,23370598.360000007,null,null,0.10597207952358897,27468223.209999986,null,null,0.11099705977128585,31464100.829999998,null,null,0.11575269167567111,35652584.649999999,null,null,0.10786738352367618,40948280.190000013,null,null,0.11059645045502933,45699770.18999999]
["SA","South Australia",null,null,0.1938958180676664,{"$f":"IFERROR(VLOOKUP($A$58,'[8]Geographic '!$A$1:$C$10,3,FALSE),0)","v":32783552.870000008},null,null,0.19968500875222178,46036379.569999985,null,null,0.19128336687614966,49581118.359999999,null,null,0.18357148215288413,52036618.229999989,null,null,0.17755426125313886,54687871.510000005,null,null,0.18890631468762331,71712026.849999994,null,null,0.18235812797236814,75352549.800000027]
["NT","Northern Territory",null,null,1.2173832526264279E-3,{"$f":"IFERROR(VLOOKUP($A$59,'[8]Geographic '!$A$1:$C$10,3,FALSE),0)","v":205832.95},null,null,1.1412866660165234E-3,263117.93,null,null,1.0292118940388433E-3,266774.25,null,null,9.5387997168539418E-4,270394.32999999996,null,null,8.8952182906726796E-4,273978.52999999997,null,null,8.6900025399894957E-4,329887.17,null,null,8.0685162848566404E-4,333400.7]
["ACT","Australian Capital Territory",null,null,3.3297968167665491E-4,{"$f":"IFERROR(VLOOKUP($A$60,'[8]Geographic '!$A$1:$C$10,3,FALSE),0)","v":56299.599999999991},null,null,2.9136928203864367E-4,67173.729999999981,null,null,3.0975412595796452E-4,80289.03,null,null,3.4659627474037949E-4,98248.909999999989,null,null,3.6088566298617727E-4,111155.14,null,null,3.3939870667174042E-4,128841.47999999998,null,null,3.4265033904465526E-4,141587.19999999998]
{"$rows_left_out":182}
{"sheet":"Note Balance","index":1,"n_rows":152,"n_cols":8,"rows_kept":152,"cut":false,"hidden":false,"merged":[]}
[null,null,"TOTAL NOTE BALANCES"]
[null,null,null,"Total Notes","Class A1 Notes","Class A2 Notes","Class B Notes","Class C Notes"]
[null,null,"Initial Invested Amount",{"$f":"SUM(E3:H3)","v":417600000},122000000,272200000,13500000,9900000]
[null,null,"Invested Amount as at Previous Payment Date:  17 August 2017",{"$f":"SUM(E4:H4)","v":417600000},122000000,272200000,13500000,9900000]
[null,null,"Stated Amount as at Previous Payment Date:  17 August 2017",{"$f":"SUM(E5:H5)","v":417600000},122000000,272200000,13500000,9900000]
[null,null,"Principal Payments to Noteholders on Payment Date",36788093.090000004,36788093.090000004,0,0,0]
[null,null,"Gross Aggregate Charge-Offs",0,0,0,0,0]
[null,null,"Gross Aggregate Reinstatements of charge-offs",0,0,0,0,0]
[null,null,"Aggregate Charge-Offs for this Collection Period",0,0,0,0,0]
[null,null,"Reinstatements relating to Charge-offs that have occurred this Collection Period",0,0,0,0,0]
[null,null,"Aggregate Carry Over Charge-offs not previously reinstated",0,0,0,0,0]
[null,null,"Reinstatements of Carry Over Charge-offs not previously reinstated",0,0,0,0,0]
[null,null,"Aggregate Charge-Offs not reinstated and to be carried over to next period",0,0,0,0,0]
[null,null,"Invested Amount as at Payment Date:  16 November 2017",{"$f":"SUM(E14:H14)","v":380811906.90999997},85211906.909999996,272200000,13500000,9900000]
[null,null,"Stated Amount as at Payment Date:  16 November 2017",{"$f":"SUM(E15:H15)","v":380811906.90999997},85211906.909999996,272200000,13500000,9900000]
[null,null,"Bond Factor at Payment Date:  16 November 2017",null,0.6984582533606557,1,1,1]
[null,null,"Coupon Margin",null,5.7999999999999996E-3,9.2999999999999992E-3,1.7000000000000001E-2,2.3E-2]
[null,null,"Coupon Rate (3 month BBSW + margin)",null,2.2749999999999999E-2,2.6249999999999999E-2,3.3950000000000001E-2,3.9949999999999999E-2]
[null,null,"Days in Coupon Period",null,91,91,91,91]
[null,null,"Coupon Entitlement to be paid out on the current Payment Date: 16 November 2017",null,691973.97,1781418.49,114267.33,98605.36]
[]
[]
[null,null,"TOTAL NOTE BALANCES"]
[null,null,null,"Total Notes","Class A1 Notes","Class A2 Notes","Class B Notes","Class C Notes"]
[null,null,"Initial Invested Amount",{"$f":"SUM(E25:H25)","v":417600000},122000000,272200000,13500000,9900000]
[null,null,"Invested Amount as at Previous Payment Date:  16 November 2017",{"$f":"SUM(E26:H26)","v":380811906.90999997},85211906.909999996,272200000,13500000,9900000]
[null,null,"Stated Amount as at Previous Payment Date:  16 November 2017",{"$f":"SUM(E27:H27)","v":380811906.90999997},85211906.909999996,272200000,13500000,9900000]
[null,null,"Principal Payments to Noteholders on Payment Date",{"$f":"SUM(E28:H28)","v":33408797.100000001},33408797.100000001,0,0,0]
[null,null,"Gross Aggregate Charge-Offs",0,0,0,0,0]
[null,null,"Gross Aggregate Reinstatements of charge-offs",0,0,0,0,0]
[null,null,"Aggregate Charge-Offs for this Collection Period",0,0,0,0,0]
[null,null,"Reinstatements relating to Charge-offs that have occurred this Collection Period",0,0,0,0,0]
[null,null,"Aggregate Carry Over Charge-offs not previously reinstated",0,0,0,0,0]
[null,null,"Reinstatements of Carry Over Charge-offs not previously reinstated",0,0,0,0,0]
[null,null,"Aggregate Charge-Offs not reinstated and to be carried over to next period",0,0,0,0,0]
[null,null,"Invested Amount as at Payment Date:  16 February 2018",{"$f":"SUM(E36:H36)","v":347403109.81},51803109.809999995,272200000,13500000,9900000]
[null,null,"Stated Amount as at Payment Date:  16 February 2018",{"$f":"SUM(E37:H37)","v":347403109.81},51803109.809999995,272200000,13500000,9900000]
[null,null,"Bond Factor at Payment Date:  16 February 2018",null,0.42461565418032782,1,1,1]
[null,null,"Coupon Margin",null,5.7999999999999996E-3,9.2999999999999992E-3,1.7000000000000001E-2,2.3E-2]
[null,null,"Coupon Rate (3 month BBSW + margin)",null,2.3E-2,2.6499999999999999E-2,3.4200000000000001E-2,4.02E-2]
[null,null,"Days in Coupon Period",null,92,92,92,92]
[null,null,"Coupon Entitlement to be paid out on the current Payment Date: 16 February 2018",null,493995.6,1818146.85,116373.7,100312.77]
[]
[]
[null,null,"TOTAL NOTE BALANCES"]
[null,null,null,"Total Notes","Class A1 Notes","Class A2 Notes","Class B Notes","Class C Notes"]
[null,null,"Initial Invested Amount",{"$f":"SUM(E47:H47)","v":417600000},122000000,272200000,13500000,9900000]
[null,null,"Invested Amount as at Previous Payment Date:  16 February 2018",{"$f":"SUM(E48:H48)","v":347403109.81},51803109.809999995,272200000,13500000,9900000]
[null,null,"Stated Amount as at Previous Payment Date:  16 February 2018",{"$f":"SUM(E49:H49)","v":347403109.81},51803109.809999995,272200000,13500000,9900000]
[null,null,"Principal Payments to Noteholders on Payment Date",{"$f":"SUM(E50:H50)","v":71610357.760000005},51803109.810000002,19807247.949999999,0,0]
[null,null,"Gross Aggregate Charge-Offs",0,0,0,0,0]
[null,null,"Gross Aggregate Reinstatements of charge-offs",0,0,0,0,0]
[null,null,"Aggregate Charge-Offs for this Collection Period",0,0,0,0,0]
[null,null,"Reinstatements relating to Charge-offs that have occurred this Collection Period",0,0,0,0,0]
[null,null,"Aggregate Carry Over Charge-offs not previously reinstated",0,0,0,0,0]
[null,null,"Reinstatements of Carry Over Charge-offs not previously reinstated",0,0,0,0,0]
[null,null,"Aggregate Charge-Offs not reinstated and to be carried over to next period",0,0,0,0,0]
[null,null,"Invested Amount as at Payment Date:  16 May 2018",{"$f":"SUM(E58:H58)","v":275792752.05000001},0,252392752.05000001,13500000,9900000]
[null,null,"Stated Amount as at Payment Date:  16 May 2018",{"$f":"SUM(E59:H59)","v":275792752.05000001},-7.4505805969238281E-9,252392752.05000001,13500000,9900000]
[null,null,"Bond Factor at Payment Date:  16 May 2018",null,-6.1070332761670722E-17,0.92723274081557683,1,1]
{"$rows_left_out":93}
{"sheet":"Cumulative Defaults","index":2,"n_rows":10,"n_cols":4,"rows_kept":10,"cut":false,"hidden":false,"merged":[]}
["Cumulative Defaults & Losses"]
[]
["Month","Gross Losses","Recoveries","Net Losses"]
["2017-10-01",0,0,0]
["2018-01-01",4.1383160000000002E-4,0,4.1383160000000002E-4]
["2018-04-01",4.1383160000000002E-4,4.850987474747474E-4,0]
["2018-07-01",4.4094924444444445E-4,4.850987474747474E-4,-4.4149503030302959E-5]
["2018-10-01",8.6438315555555556E-4,4.8829874747474743E-4,3.7608440808080813E-4]
["2019-01-01",8.6438315555555556E-4,4.9229874747474742E-4,3.7208440808080814E-4]
["2019-04-01",{"$f":"B9+'Collateral Tables'!E9/450000000","v":8.6438315555555556E-4},{"$f":"C9+'Collateral Tables'!E23/450000000","v":4.9749874747474743E-4},{"$f":"B10-C10","v":3.6688440808080812E-4}]